{"text_format":"1","workbook":"xlsx","n_sheets":12,"sheets":["INSTRUCTIONS","Funding by District","1) School Information","2) Enrollment Chart","3) Staffing Plan","4) Pre-Opening Period Budget","5) Pre-OP Cash Flow 1-Year","6) Year 1 Budget & Assumptions","7) Year 1 Cash Flow","8) 5 YR Budget & Cash Flow Adj","9) Fiscal Impact","CONTROL"],"not_rendered":{"charts":0,"images":1,"macros":1,"external_links":2,"defined_names":123,"comments":8,"pivot_tables":0},"unopened":[],"bounds":{"document_bytes":16777216,"sheet_cells":100000,"rows_first":2000,"rows_last":500,"rows_between":2000,"halvings":0,"cell_chars":16384,"cell_head_chars":4096},"cells_cut":0,"cells_raw":0,"read":"whole","date_system":"1900"}

{"sheet":"INSTRUCTIONS","index":0,"n_rows":31,"n_cols":5,"rows_kept":31,"cut":false,"hidden":false,"merged":[[29,3,29,4]]}
[]
[]
[]
[]
[]
[]
[null,null,"GENERAL INSTRUCTIONS FOR 2021 NEW SCHOOL PROPOSAL\nBUDGETS AND CASH FLOWS"]
[]
[null,null,"TAB COLORS"]
[null,null,"1- GRAY tabs contain the Instructions and the Funding by Districts Table."]
[null,null,null,"Instructions","- Provides description of tabs and input requirements."]
[null,null,null,"Funding by District","- Reference table with Per Pupil Revenue for current year."]
[null,null,"2- BLUE tabs require input of information.  "]
[null,null,null,"1) School Information","- Enter school name, contact information and planned dates for proposed budgets."]
[null,null,null,"2) Enrollment Chart","- Enter enrollment information on this tab to be automatically populated throughout workbook."]
{"$rows_left_out":17}
{"sheet":"Funding by District","index":1,"n_rows":685,"n_cols":6,"rows_kept":685,"cut":false,"hidden":false,"merged":[]}
[]
[null,null,"Charter Funding Alphabetical By NYS School District"]
[null,null,"* (Sum of Charter School Basic Tuition and Supplemental Basic Tuition)"]
[]
[null,null,"District Code","School District Name","Final 2019-20 Basic Tuition*","Final 2020-21 Basic Tuition*"]
[null,null,"570101","ADDISON CSD",12682,12430]
[null,null,"410401","ADIRONDACK CSD",13171,12624]
[null,null,"080101","AFTON CSD",15181,13622]
[null,null,"142101","AKRON CSD",11581,11368]
[null,null,"010100","ALBANY CITY SD",15861,15718]
[null,null,"450101","ALBION CSD",11718,11275]
[null,null,"140101","ALDEN CSD",11338,10931]
[null,null,"180202","ALEXANDER CSD",13456,12884]
[null,null,"220202","ALEXANDRIA CSD",13378,13073]
[null,null,"020101","ALFRED-ALMOND CSD",12544,12405]
{"$rows_left_out":671}
{"sheet":"1) School Information","index":2,"n_rows":20,"n_cols":4,"rows_kept":20,"cut":false,"hidden":false,"merged":[[8,1,8,3],[10,1,10,4],[7,1,7,4]]}
[]
[]
[]
[]
[]
[]
[]
[null,"2021 New School Proposal\nBudget(s) & Cash Flow(s) Template"]
[]
[]
[null,"enter school name here"]
[]
[null,"Contact Name:",null,"enter name"]
[null,"Contact Title:",null,"enter title"]
[null,"Contact Email:",null,"enter email address"]
{"$rows_left_out":6}
{"sheet":"2) Enrollment Chart","index":3,"n_rows":135,"n_cols":9,"rows_kept":135,"cut":false,"hidden":false,"merged":[[19,1,19,2],[37,1,37,2],[55,1,55,2],[58,1,58,2],[64,1,64,2],[20,1,20,2],[38,1,38,2],[59,1,59,2],[60,1,60,2],[61,1,61,2],[62,1,62,2],[63,1,63,2],[65,1,65,2],[79,3,79,7],[79,1,79,2],[68,1,68,7],[84,1,84,2],[84,3,84,7]]}
[]
[null,{"$f":"UPPER('4) Pre-Opening Period Budget'!B2)","v":"PLEASE ENTER SCHOOL NAME ON TAB - \"1) SCHOOL INFORMATION\""}]
[null,{"$f":"CharterPeriod","v":"PLEASE ENTER \"FIRST ACADEMIC YEAR\" ON TAB \"1.) SCHOOL INFORMATION.\""}]
[]
[null,"CHARTER ENROLLMENT BY GRADE"]
[null,"GRADES","LEVEL",{"$f":"CONTROL!$G$19","v":""},{"$f":"CONTROL!$G$20","v":""},{"$f":"CONTROL!$G$21","v":""},{"$f":"CONTROL!$G$22","v":""},{"$f":"CONTROL!$G$23","v":""},"AGE RANGE"]
[null,"Kindergarten","Elementary School"]
[null,"1st Grade","Elementary School"]
[null,"2nd Grade","Elementary School"]
[null,"3rd Grade","Elementary School"]
[null,"4th Grade","Elementary School"]
[null,"5th Grade","Select grade 5 level from dropdown list →"]
[null,"6th Grade","Middle School"]
[null,"7th Grade","Middle School"]
[null,"8th Grade","Middle School"]
{"$rows_left_out":121}
{"sheet":"3) Staffing Plan","index":4,"n_rows":78,"n_cols":10,"rows_kept":78,"cut":false,"hidden":false,"merged":[[46,2,46,7],[41,1,44,1],[8,3,8,7]]}
[]
[null,{"$f":"IF(CONTROL!$J$5=0,Mssg1,School)","v":"Please enter school name on tab - \"1) School Information\""}]
[]
[null,null,null,"Year 1","Year 2","Year 3","Year 4","Year 5"]
[null,null,"Acad Years",{"$f":"CONTROL!$G$19","v":""},{"$f":"CONTROL!$G$20","v":""},{"$f":"CONTROL!$G$21","v":""},{"$f":"CONTROL!$G$22","v":""},{"$f":"CONTROL!$G$23","v":""}]
[null,null,"Grades",{"$f":"CONTROL!E91","v":""},{"$f":"CONTROL!F91","v":""},{"$f":"CONTROL!G91","v":""},{"$f":"CONTROL!H91","v":""},{"$f":"CONTROL!I91","v":""}]
[null,null,"Enrollment",{"$f":"CONTROL!E57","v":"Complete Tab 2"},{"$f":"CONTROL!F57","v":"Complete Tab 2"},{"$f":"CONTROL!G57","v":"Complete Tab 2"},{"$f":"CONTROL!H57","v":"Complete Tab 2"},{"$f":"CONTROL!I57","v":"Complete Tab 2"},null,{"$f":"IFERROR(INDEX(CONTROL!$N$53:$N$55,MATCH(CONTROL!$L$55,CONTROL!$M$53:$M$55,0)),\"\")","v":"Please enter enrollment data for ALL years on Tab 2.  "}]
[]
[null,null,null,"*NOTE:  Enter the number of planned full-time equivalent (\"FTE\") positions\nin each category for each charter year in the section provided below.",null,null,null,null,null,"*NOTE:  State the assumptions that are being made for personnel\nFTE levels in the section provided below."]
[]
[null,"ADMINISTRATIVE PERSONNEL FTE",null,"FTE",null,null,null,null,null,"Description of Assumptions"]
[null,"Executive Management",null,0,0,0,0,0]
[null,"Instructional Management",null,0,0,0,0,0]
[null,"Deans, Directors & Coordinators",null,0,0,0,0,0]
[null,"CFO / Director of Finance",null,0,0,0,0,0]
{"$rows_left_out":64}
{"sheet":"4) Pre-Opening Period Budget","index":5,"n_rows":156,"n_cols":10,"rows_kept":156,"cut":false,"hidden":false,"merged":[[10,8,11,8]]}
[]
[null,{"$f":"IF(CONTROL!J5=0,Mssg1,UPPER(School))","v":"Please enter school name on tab - \"1) School Information\""}]
[null,"PROJECTED BUDGET / OPERATING PLAN FOR PRE-OPENING PERIOD"]
[null,{"$f":"IF(PreOpenPd=\"\",Mssg2,PreOpenPd)","v":"Select from dropdown list →"}]
[null,"*NOTE: Please enter financial data on \"6) Pre-OP Cash Flow 1-Year.\"\nThe pre-opening budget will be for a 1-Year Period as selected on tab #1, School Information."]
[null,null,null,null,null,null,null,null,null,"DESCRIPTION OF ASSUMPTIONS"]
[null,"Total Revenue",null,null,null,null,null,null,{"$f":"I41","v":0}]
[null,"Total Expenses",null,null,null,null,null,null,{"$f":"I130","v":0}]
[null,"Net Income",null,null,null,null,null,null,{"$f":"I7-I8","v":0}]
[]
[null,null,null,null,null,null,null,null,"START-UP PERIOD"]
[]
[]
[null,"REVENUE"]
[null,null,"REVENUES FROM STATE SOURCES"]
{"$rows_left_out":142}
{"sheet":"5) Pre-OP Cash Flow 1-Year","index":6,"n_rows":154,"n_cols":22,"rows_kept":154,"cut":false,"hidden":false,"merged":[[3,1,4,7],[12,1,12,4],[1,1,2,7]]}
[]
[null,"PRE-OPENING CASH FLOW 1-YEAR",null,null,null,null,null,null,{"$f":"'4) Pre-Opening Period Budget'!B2","v":"Please enter school name on tab - \"1) School Information\""}]
[]
[null,"*NOTE:\nPlease enter \"Description of Assumptions\" on tab \"4) Pre-Opening Period Budget.\"",null,null,null,null,null,null,"PROJECTED CASH FLOW FOR SCHOOLS PROPOSING TO OPEN IN THE SECOND YEAR FOLLOWING PROPOSAL SUBMISSION"]
[null,null,null,null,null,null,null,null,{"$f":"IF(OR(PreOpenPd=\"\",PreOpenPd=\"Select from dropdown list →\"),Mssg2,IF(PreOpenType=CONTROL!B33,\"Do NOT complete this section.  Complete tab \"\"5) Pre-OP Cash Flow 6-Mo.\"\"\",PreOpenPd))","v":"Please complete entering all information  on tab - \"1) School Information\""}]
[null,"Total Revenue",null,null,null,null,null,null,{"$f":"I41","v":0},0,0,0,0,0,0,0,0,0,0,0,0]
[null,"Total Expenses",null,null,null,null,null,null,{"$f":"I130","v":0},0,0,0,0,0,0,0,0,0,0,0,0]
[null,"Net Income",null,null,null,null,null,null,{"$f":"I6-I7","v":0},0,0,0,0,0,0,0,0,0,0,0,0]
[null,"Cash Flow Adjustments",null,null,null,null,null,null,{"$f":"I148","v":0},0,0,0,0,0,0,0,0,0,0,0,0]
[null,"Beginning Cash Balance",null,null,null,null,null,null,{"$f":"I152","v":0},0,0,0,0,0,0,0,0,0,0,0,0]
[null,"Net Income",null,null,null,null,null,null,{"$f":"SUM(I8:I10)","v":0},0,0,0,0,0,0,0,0,0,0,0,0]
[]
[null,null,null,null,null,null,null,null,"JUL","AUG","SEP","OCT","NOV","DEC","JAN","FEB","MAR","APR","MAY","JUN","TOTAL",{"$f":"COUNTIF(#REF!,\"<>0\")","v":{"$error":"#REF!"}}]
[null,"REVENUE",null,null,null,null,null,null,null,null,null,null,null,null,null,null,null,null,null,null,null,{"$f":"PreOpenPd=PreOp1Yr","v":false}]
[null,null,"REVENUES FROM STATE SOURCES"]
{"$rows_left_out":140}
{"sheet":"6) Year 1 Budget & Assumptions","index":7,"n_rows":180,"n_cols":17,"rows_kept":180,"cut":false,"hidden":false,"merged":[[2,14,3,14],[10,1,11,4],[10,8,10,10],[10,11,10,12],[1,8,1,13],[3,8,3,13],[4,8,4,13],[1,1,4,7]]}
[null,null,null,null,null,null,null,null,14]
[null,"YEAR 1 BUDGET AND ASSUMPTION",null,null,null,null,null,null,{"$f":"'4) Pre-Opening Period Budget'!B2","v":"Please enter school name on tab - \"1) School Information\""},null,null,null,null,null,null,null,"Error Checking (Comparison to Tabs 8 & 9)"]
[null,null,null,null,null,null,null,null,null,null,null,null,null,null,"DESCRIPTION OF ASSUMPTIONS",null,{"$f":"IF(COUNTIFS(Q6:Q180,\"<>OK\",Q6:Q180,\"<>\")<>0,\"Totals Unequal - (See Below)\",\"Totals Match\")","v":"Totals Match"}]
[null,null,null,null,null,null,null,null,"PROJECTED BUDGET / OPERATING PLAN FOR YEAR ONE"]
[null,null,null,null,null,null,null,null,{"$f":"IF(AcadYr1=CONTROL!B18,Mssg2,\"JULY 1, \"&Year1-1&\" - JUNE 30, \"&Year1)","v":"Please complete entering all information  on tab - \"1) School Information\""},null,null,null,null,null,"*NOTE:  State assumptions that are being made for the 1-Year Budget in the section provided below."]
[null,"Total Revenue",null,null,null,null,null,null,{"$f":"I65","v":0},0,0,0,0,0,null,null,{"$f":"IF(AND(N6='7) Year 1 Cash Flow'!U6,'8) 5 YR Budget & Cash Flow Adj'!I6='7) Year 1 Cash Flow'!U6),\"OK\",IF('7) Year 1 Cash Flow'!U6='8) 5 YR Budget & Cash Flow Adj'!I6,\"Tab 7 is Different by \"&TEXT(ABS('7) Year 1 Cash Flow'!U6-N6),\"#,###.00\"),IF(N6='8) 5 YR Budget & Cash Flow Adj'!I6,\"Tab 8 is Different by \"&TEXT(ABS('8) 5 YR Budget & Cash Flow Adj'!I6-'7) Year 1 Cash Flow'!U6),\"#,###.00\"),\"Tab 9 is Different by \"&TEXT(ABS('7) Year 1 Cash Flow'!U6-'8) 5 YR Budget & Cash Flow Adj'!I6),\"#,###.00\"))))","v":"OK"}]
[null,"Total Expenses",null,null,null,null,null,null,{"$f":"I155","v":0},0,0,0,0,0,null,null,{"$f":"IF(AND(N7='7) Year 1 Cash Flow'!U7,'8) 5 YR Budget & Cash Flow Adj'!I7='7) Year 1 Cash Flow'!U7),\"OK\",IF('7) Year 1 Cash Flow'!U7='8) 5 YR Budget & Cash Flow Adj'!I7,\"Tab 7 is Different by \"&TEXT(ABS('7) Year 1 Cash Flow'!U7-N7),\"#,###.00\"),IF(N7='8) 5 YR Budget & Cash Flow Adj'!I7,\"Tab 8 is Different by \"&TEXT(ABS('8) 5 YR Budget & Cash Flow Adj'!I7-'7) Year 1 Cash Flow'!U7),\"#,###.00\"),\"Tab 9 is Different by \"&TEXT(ABS('7) Year 1 Cash Flow'!U7-'8) 5 YR Budget & Cash Flow Adj'!I7),\"#,###.00\"))))","v":"OK"}]
[null,"Net Income",null,null,null,null,null,null,{"$f":"I6-I7","v":0},0,0,0,0,0,null,null,{"$f":"IF(AND(N8='7) Year 1 Cash Flow'!U8,'8) 5 YR Budget & Cash Flow Adj'!I8='7) Year 1 Cash Flow'!U8),\"OK\",IF('7) Year 1 Cash Flow'!U8='8) 5 YR Budget & Cash Flow Adj'!I8,\"Tab 7 is Different by \"&TEXT(ABS('7) Year 1 Cash Flow'!U8-N8),\"#,###.00\"),IF(N8='8) 5 YR Budget & Cash Flow Adj'!I8,\"Tab 8 is Different by \"&TEXT(ABS('8) 5 YR Budget & Cash Flow Adj'!I8-'7) Year 1 Cash Flow'!U8),\"#,###.00\"),\"Tab 9 is Different by \"&TEXT(ABS('7) Year 1 Cash Flow'!U8-'8) 5 YR Budget & Cash Flow Adj'!I8),\"#,###.00\"))))","v":"OK"}]
[null,"Budgeted Student Enrollment",null,null,null,null,null,null,{"$f":"I176","v":0},{"$f":"J176","v":0},null,null,null,{"$f":"N176","v":0},null,null,{"$f":"IF(N9='8) 5 YR Budget & Cash Flow Adj'!I9=TRUE,\"OK\",\"Tab 7 is UNEQUAL to Tab 9\")","v":"OK"}]
[]
[null,null,null,null,null,null,null,null,"PROGRAM SERVICES",null,null,"SUPPORT SERVICES"]
[null,null,null,null,null,null,null,null,"REGULAR EDUCATION","SPECIAL EDUCATION","OTHER","FUNDRAISING","MANAGEMENT & GENERAL","TOTAL"]
[]
[null,"REVENUE"]
[null,null,"REVENUES FROM STATE SOURCES"]
{"$rows_left_out":166}
{"sheet":"7) Year 1 Cash Flow","index":8,"n_rows":181,"n_cols":23,"rows_kept":181,"cut":false,"hidden":false,"merged":[[14,8,15,20],[12,1,12,4],[1,8,1,20],[2,8,2,20],[3,8,3,20],[4,8,4,20],[1,1,4,7]]}
[]
[null,"YEAR 1 CASH FLOW\n(FIRST YEAR OF CHARTER)",null,null,null,null,null,null,{"$f":"'4) Pre-Opening Period Budget'!B2","v":"Please enter school name on tab - \"1) School Information\""},null,null,null,null,null,null,null,null,null,null,null,null,null,"Error Checking (Comparison to Tabs 7 & 9)"]
[null,null,null,null,null,null,null,null,"PROJECTED CASH FLOW FOR YEAR ONE OF OPERATIONS",null,null,null,null,null,null,null,null,null,null,null,null,null,{"$f":"IF(COUNTIFS(W6:W181,\"<>OK\",W6:W181,\"<>\")<>0,\"TOTALS UNEQUAL - (See Below)\",\"TOTALS MATCH\")","v":"TOTALS MATCH"}]
[null,null,null,null,null,null,null,null,{"$f":"'6) Year 1 Budget & Assumptions'!I5","v":"Please complete entering all information  on tab - \"1) School Information\""}]
[]
[null,"Total Revenue",null,null,null,null,null,null,{"$f":"I66","v":0},0,0,0,0,0,0,0,0,0,0,0,0,null,{"$f":"IF(AND('6) Year 1 Budget & Assumptions'!N6=U6,'8) 5 YR Budget & Cash Flow Adj'!I6=U6),\"OK\",IF(U6='8) 5 YR Budget & Cash Flow Adj'!I6,\"Tab 7 is Different by \"&TEXT(ABS(U6-'6) Year 1 Budget & Assumptions'!N6),\"#,###.00\"),IF('6) Year 1 Budget & Assumptions'!N6='8) 5 YR Budget & Cash Flow Adj'!I6,\"Tab 8 is Different by \"&TEXT(ABS('8) 5 YR Budget & Cash Flow Adj'!I6-U6),\"#,###.00\"),\"Tab 9 is Different by \"&TEXT(ABS(U6-'8) 5 YR Budget & Cash Flow Adj'!I6),\"#,###.00\"))))","v":"OK"}]
[null,"Total Expenses",null,null,null,null,null,null,{"$f":"I156","v":0},0,0,0,0,0,0,0,0,0,0,0,0,null,{"$f":"IF(AND('6) Year 1 Budget & Assumptions'!N7=U7,'8) 5 YR Budget & Cash Flow Adj'!I7=U7),\"OK\",IF(U7='8) 5 YR Budget & Cash Flow Adj'!I7,\"Tab 7 is Different by \"&TEXT(ABS(U7-'6) Year 1 Budget & Assumptions'!N7),\"#,###.00\"),IF('6) Year 1 Budget & Assumptions'!N7='8) 5 YR Budget & Cash Flow Adj'!I7,\"Tab 8 is Different by \"&TEXT(ABS('8) 5 YR Budget & Cash Flow Adj'!I7-U7),\"#,###.00\"),\"Tab 9 is Different by \"&TEXT(ABS(U7-'8) 5 YR Budget & Cash Flow Adj'!I7),\"#,###.00\"))))","v":"OK"}]
[null,"Net Income",null,null,null,null,null,null,{"$f":"I6-I7","v":0},0,0,0,0,0,0,0,0,0,0,0,0,null,{"$f":"IF(AND('6) Year 1 Budget & Assumptions'!N8=U8,'8) 5 YR Budget & Cash Flow Adj'!I8=U8),\"OK\",IF(U8='8) 5 YR Budget & Cash Flow Adj'!I8,\"Tab 7 is Different by \"&TEXT(ABS(U8-'6) Year 1 Budget & Assumptions'!N8),\"#,###.00\"),IF('6) Year 1 Budget & Assumptions'!N8='8) 5 YR Budget & Cash Flow Adj'!I8,\"Tab 8 is Different by \"&TEXT(ABS('8) 5 YR Budget & Cash Flow Adj'!I8-U8),\"#,###.00\"),\"Tab 9 is Different by \"&TEXT(ABS(U8-'8) 5 YR Budget & Cash Flow Adj'!I8),\"#,###.00\"))))","v":"OK"}]
[null,"Cash Flow Adjustments",null,null,null,null,null,null,{"$f":"I175","v":0},0,0,0,0,0,0,0,0,0,0,0,0,null,{"$f":"IF(U9='8) 5 YR Budget & Cash Flow Adj'!I196=TRUE,\"OK\",\"Tab 7 is UNEQUAL to Tab 9\")","v":"OK"}]
[null,"Beginning Cash Balance",null,null,null,null,null,null,{"$f":"I179","v":0},0,0,0,0,0,0,0,0,0,0,0,0,null,{"$f":"IF(U10='8) 5 YR Budget & Cash Flow Adj'!I200=TRUE,\"OK\",\"Tab 7 is UNEQUAL to Tab 9\")","v":"OK"}]
[null,"Ending Cash Balance",null,null,null,null,null,null,{"$f":"SUM(I8:I10)","v":0},0,0,0,0,0,0,0,0,0,0,0,0,null,{"$f":"IF(U11='8) 5 YR Budget & Cash Flow Adj'!I202=TRUE,\"OK\",\"Tab 7 is UNEQUAL to Tab 9\")","v":"OK"}]
[]
[null,null,null,null,null,null,null,null,"JUL","AUG","SEP","OCT","NOV","DEC","JAN","FEB","MAR","APR","MAY","JUN","TOTAL"]
[]
[null,"REVENUE",null,null,null,null,null,null,"* Totals (Column U) for all lines above Cash Flow Adjustments should equal the Totals (Column N) on tab \"7) Year 1 Budget & Assumptions.\""]
{"$rows_left_out":167}
{"sheet":"8) 5 YR Budget & Cash Flow Adj","index":9,"n_rows":202,"n_cols":14,"rows_kept":202,"cut":false,"hidden":false,"merged":[[1,1,3,5],[3,6,3,12],[4,6,4,12],[1,6,2,12],[13,8,13,12],[10,7,11,7],[10,1,11,4],[10,6,11,6],[4,1,4,5]]}
[]
[null,"5 YEAR BUDGET AND CASH FLOW ADJUSTMENTS",null,null,null,null,{"$f":"UPPER('4) Pre-Opening Period Budget'!B2)","v":"PLEASE ENTER SCHOOL NAME ON TAB - \"1) SCHOOL INFORMATION\""}]
[null,null,null,null,null,null,null,null,null,null,null,null,null,"DESCRIPTION OF ASSUMPTIONS"]
[null,null,null,null,null,null,"PROJECTED BUDGET / OPERATING PLAN FOR INITIAL CHARTER PERIOD"]
[null,"*NOTE: Projected Five Year Budget on this tab should be\n for the first five years of actual operations.",null,null,null,null,{"$f":"CONTROL!$G$19&\" THROUGH \"&CONTROL!$G$23","v":" THROUGH "},null,null,null,null,null,null,"*NOTE:  State assumptions that are being made in the section provided below."]
[null,"Total Revenue",null,null,null,null,null,null,{"$f":"I65","v":0},{"$f":"J65","v":0},{"$f":"K65","v":0},{"$f":"L65","v":0},{"$f":"M65","v":0}]
[null,"Total Expenses",null,null,null,null,null,null,{"$f":"I155","v":0},{"$f":"J155","v":0},{"$f":"K155","v":0},{"$f":"L155","v":0},{"$f":"M155","v":0}]
[null,"Net Income (Before Cash Flow Adjustments)",null,null,null,null,null,null,{"$f":"I6-I7","v":0},{"$f":"J157","v":0},{"$f":"K157","v":0},{"$f":"L157","v":0},{"$f":"M157","v":0}]
[null,"Budgeted Student Enrollment",null,null,null,null,null,null,{"$f":"I176","v":0},{"$f":"J176","v":0},{"$f":"K176","v":0},{"$f":"L176","v":0},{"$f":"M176","v":0}]
[]
[null,null,null,null,null,null,null,null,"Year 1","Year 2","Year 3","Year 4","Year 5"]
[null,null,null,null,null,null,null,null,{"$f":"CONTROL!G19","v":""},{"$f":"CONTROL!G20","v":""},{"$f":"CONTROL!G21","v":""},{"$f":"CONTROL!G22","v":""},{"$f":"CONTROL!G23","v":""}]
[]
[null,"REVENUE",null,null,null,null,null,null,"Per Pupil Revenue Percentage Increase"]
[null,null,"REVENUES FROM STATE SOURCES"]
{"$rows_left_out":188}
{"sheet":"9) Fiscal Impact","index":10,"n_rows":26,"n_cols":9,"rows_kept":26,"cut":false,"hidden":false,"merged":[[24,1,24,3],[24,4,24,8],[25,1,25,3],[25,4,25,8],[15,1,15,8],[12,1,12,3],[13,1,13,3],[12,4,12,8],[13,4,13,8],[3,1,3,8]]}
[]
[null,"5-YEAR FISCAL IMPACT REPORT"]
[]
[null,{"$f":"IF(CONTROL!B98=CONTROL!$B$167,Mssg3,\"Largest Enrollment District:  \"&CONTROL!B98)","v":"Please complete entering all information on tab - \"2) Enrollment Chart\""}]
[null,"A","B","C","D\n( B X C )","E","F\n( D + E )","G","H\n( F ÷ G )"]
[null,"Operational\nYear","Enrollment (Number of Students)","Per Pupil Rate","Per Pupil Aid","Other District Revenue (SPED Funding, Food Service, Grants, Etc.)","Total Funding to Charter School From District",{"$f":"\"* Total General Fund Operating Budget for \"&IF(CONTROL!B98=\"(Select from drop-down list)\",\"???\",CONTROL!B98)&\" School District\"","v":"* Total General Fund Operating Budget for Select from drop-down list → School District"},"Projected Impact (% of District's Total Budget)"]
[null,{"$f":"\"Year 1 (\"&CONTROL!G19&\")\"","v":"Year 1 ()"},{"$f":"'8) 5 YR Budget & Cash Flow Adj'!I160","v":0},{"$f":"'8) 5 YR Budget & Cash Flow Adj'!G17*(1+'8) 5 YR Budget & Cash Flow Adj'!I15)","v":0},{"$f":"C7*D7","v":0},0,{"$f":"E7+F7","v":0},{"$f":"'2) Enrollment Chart'!D$78","v":0},{"$f":"G7/H7","v":{"$error":"#DIV/0!"}}]
[null,{"$f":"\"Year 2 (\"&CONTROL!G20&\")\"","v":"Year 2 ()"},{"$f":"'8) 5 YR Budget & Cash Flow Adj'!J160","v":0},{"$f":"D7*(1+'8) 5 YR Budget & Cash Flow Adj'!$J$15)","v":0},{"$f":"C8*D8","v":0},0,{"$f":"E8+F8","v":0},{"$f":"'2) Enrollment Chart'!E$78","v":0},{"$f":"G8/H8","v":{"$error":"#DIV/0!"}}]
[null,{"$f":"\"Year 3 (\"&CONTROL!G21&\")\"","v":"Year 3 ()"},{"$f":"'8) 5 YR Budget & Cash Flow Adj'!K160","v":0},{"$f":"D8*(1+'8) 5 YR Budget & Cash Flow Adj'!$K$15)","v":0},{"$f":"C9*D9","v":0},0,0,{"$f":"'2) Enrollment Chart'!F$78","v":0},{"$error":"#DIV/0!"}]
[null,{"$f":"\"Year 4 (\"&CONTROL!G22&\")\"","v":"Year 4 ()"},{"$f":"'8) 5 YR Budget & Cash Flow Adj'!L160","v":0},{"$f":"D9*(1+'8) 5 YR Budget & Cash Flow Adj'!$L$15)","v":0},{"$f":"C10*D10","v":0},0,0,{"$f":"'2) Enrollment Chart'!G$78","v":0},{"$error":"#DIV/0!"}]
[null,{"$f":"\"Year 5 (\"&CONTROL!G23&\")\"","v":"Year 5 ()"},{"$f":"'8) 5 YR Budget & Cash Flow Adj'!M160","v":0},{"$f":"D10*(1+'8) 5 YR Budget & Cash Flow Adj'!$M$15)","v":0},{"$f":"C11*D11","v":0},0,0,{"$f":"'2) Enrollment Chart'!H$78","v":0},{"$error":"#DIV/0!"}]
[]
[null,"DESCRIPTION OF SOURCE FOR PRIMARY DISTRICT'S OPERATING BUDGET: ",null,null,{"$f":"IF(ISBLANK('2) Enrollment Chart'!D80)=TRUE,\"(Enter Source on Tab 2, \"\"Enrollment Chart\"\")\",'2) Enrollment Chart'!D80)","v":"(Enter Source on Tab 2, \"Enrollment Chart\")"}]
[null,"OTHER NOTES:"]
[]
{"$rows_left_out":12}
{"sheet":"CONTROL","index":11,"n_rows":846,"n_cols":24,"rows_kept":846,"cut":false,"hidden":false,"merged":[[27,5,27,8],[51,13,51,19],[92,16,95,16],[95,2,96,2],[52,13,52,19],[53,13,53,19],[54,13,54,19]]}
["CONTROL SHEET"]
[]
[]
["INFORMATION COMPLETION (tab \"1) School Information\""]
[null,"School Name","User entry",null,null,null,null,null,{"$f":"UPPER('1) School Information'!B11)","v":"ENTER SCHOOL NAME HERE"},{"$f":"IF(I5=\"Enter School Name Here\",0,1)","v":0}]
[null,"Contact Name","User entry",null,null,null,null,null,{"$f":"'1) School Information'!D13","v":"enter name"}]
[null,"Contact Title","User entry",null,null,null,null,null,{"$f":"'1) School Information'!D14","v":"enter title"}]
[null,"Contact Email","User entry",null,null,null,null,null,{"$f":"'1) School Information'!D15","v":"enter email address"}]
[null,"Contact Phone","User entry",null,null,null,null,null,{"$f":"'1) School Information'!D16","v":"enter phone number"}]
[]
[null,"First Academic Year","User entry",null,null,null,null,null,{"$f":"AcadYr1","v":"Select from dropdown list →"},{"$f":"IF(I11=B18,0,1)","v":0}]
[null,"Pre-Opening Period","User entry",null,null,null,null,null,{"$f":"PreOpenPd","v":"Select from dropdown list →"}]
[null,"5 Year Charter Period","Calculated",null,null,null,null,null,{"$f":"IF(J11=1,G19&\" through \"&G23,\"PLEASE ENTER \"\"FIRST ACADEMIC YEAR\"\" ON TAB \"\"1.) SCHOOL INFORMATION.\"\"\")","v":"PLEASE ENTER \"FIRST ACADEMIC YEAR\" ON TAB \"1.) SCHOOL INFORMATION.\""}]
[]
["DATA VALIDATION LISTS"]
{"$rows_left_out":831}